{"text_format":"1","workbook":"xlsx","n_sheets":6,"sheets":["Pivot","Data","Home","General Information","Employment Information","Further Studies"],"not_rendered":{"charts":29,"images":9,"macros":1,"external_links":0,"defined_names":9,"comments":0,"pivot_tables":36},"unopened":[],"bounds":{"document_bytes":16777216,"sheet_cells":100000,"rows_first":2000,"rows_last":500,"rows_between":2000,"halvings":0,"cell_chars":16384,"cell_head_chars":4096},"cells_cut":0,"cells_raw":0,"read":"whole","date_system":"1900"}

{"sheet":"Pivot","index":0,"n_rows":323,"n_cols":13,"rows_kept":323,"cut":false,"hidden":true,"merged":[]}
[null,null,null,null,"Programme followed","(All)"]
[]
["Respondents"]
[531]
[]
[]
["Mature Student","Count of No"]
["No",0.72504708097928439]
["Not Stated",6.5913370998116755E-2]
["Yes",0.20903954802259886]
["Grand Total",1]
[]
[]
["Activity","Count of No"]
["Full time Employment",0.42937853107344631]
["Unemployed",0.2504708097928437]
["Further Studies",0.16384180790960451]
["Part time Employment",8.4745762711864403E-2]
["Unknown",3.5781544256120526E-2]
["Short term contract",3.2015065913370999E-2]
["Other",3.766478342749529E-3]
["Grand Total",1]
[]
["Q15","(Multiple Items)"]
[]
["Salary","Count of No"]
["SCR8,000 - SCR9,999",0.41964285714285715]
["SCR6,000 - SCR7,999",0.30357142857142855]
["SCR10,000 - SCR11,999",0.14732142857142858]
["Less than SCR5,999",8.4821428571428575E-2]
["Above SCR12,000",4.4642857142857144E-2]
["Grand Total",1]
[]
[]
["Female No.","Male No."]
[329,202]
[]
[]
["Q11","Count of ID"]
["Yes",0.82297551789077217]
{"$rows_left_out":284}
{"sheet":"Data","index":1,"n_rows":532,"n_cols":50,"rows_kept":532,"cut":false,"hidden":true,"merged":[]}
["No","ID","PC","Gender","Female","Male","Programme followed","Programme Level","Q10","Q11","Q12a","Q12b","Q12c","Q13","Q14","Q15","Q15_Other","Employment Status","Related","Industry","Sector","Q16","Q17","Q19","Q20a","Q20b","Q20c","Q20d","Q20e","Q20f","Q20g","Q21","Q22","Q22_Other","Q23","Q24","Q25","Q26","Q27","Q27_Agency","Q28","Q29","Q30","Q31","Q31_Other","Q32","Q33","Q34","Q35","Q35_Other"]
[1,"SBSA1","SBSA","Female",1,null,"Diploma in Office Management and Administration","Diploma","No","Yes",4,4,4,"Yes","Yes it was just right","Unemployed","","Potential labour force entrant ",0,0,0,0,0,"#NULL!","#NULL!","#NULL!","#NULL!","#NULL!","#NULL!","#NULL!","#NULL!","#NULL!","#NULL!",{"$error":"#NULL!"},"#NULL!","","#NULL!","No","No","",2,1,"Yes",5,{"$error":"#NULL!"},"Yes",0,0,"#NULL!",""]
[2,"SBSA2","SBSA","Female",1,null,"Diploma in Office Management and Administration","Diploma","No","Yes",5,4,3,"Yes","Yes it was just right","Part time Employment","","Employed","Yes","Public Administration and defence; compulsory social security","Public Service","Registration Division","Senior Registration Officer","#NULL!","#NULL!","#NULL!","#NULL!","#NULL!","#NULL!","#NULL!","#NULL!","#NULL!","#NULL!",{"$error":"#NULL!"},"#NULL!","","#NULL!","#NULL!","#NULL!","","#NULL!","#NULL!","#NULL!","#NULL!",{"$error":"#NULL!"},{"$error":"#NULL!"},0,0,"#NULL!",""]
[3,"SBSA3","SBSA","Male",null,1,"Diploma in Office Management and Administration","Diploma","No","Yes",5,5,5,"Yes","Yes it was just right","Unemployed","","Unemployed",0,0,0,0,0,"#NULL!","#NULL!","#NULL!","#NULL!","#NULL!","#NULL!","#NULL!","#NULL!","#NULL!","#NULL!",{"$error":"#NULL!"},"#NULL!","","#NULL!","Yes","No","",1,1,"Yes",3,{"$error":"#NULL!"},"Yes",0,0,"#NULL!",""]
[4,"SBSA4","SBSA","Female",1,null,"Diploma in Office Management and Administration","Diploma","No","Yes",5,5,5,"Yes","Yes it was just right","Unemployed","","Potential labour force entrant ",0,0,0,0,0,"#NULL!","#NULL!","#NULL!","#NULL!","#NULL!","#NULL!","#NULL!","#NULL!","#NULL!","#NULL!",{"$error":"#NULL!"},"#NULL!","","#NULL!","Yes","No","",3,2,"No","#NULL!",{"$error":"#NULL!"},"#NULL!",0,0,"#NULL!",""]
[5,"SBSA5","SBSA","Female",1,null,"Diploma in Office Management and Administration","Diploma","No","Yes",5,5,4,"Yes","Yes it was just right","Further Studies","","Further Studies",0,0,0,0,0,"#NULL!","#NULL!","#NULL!","#NULL!","#NULL!","#NULL!","#NULL!","#NULL!","#NULL!","#NULL!",{"$error":"#NULL!"},"#NULL!","","#NULL!","#NULL!","#NULL!","","#NULL!","#NULL!","#NULL!","#NULL!",{"$error":"#NULL!"},"#NULL!","BA(Hons) Marketing Management Specialised in Digital Marketing","Asia Pacific University","#NULL!",""]
[6,"SBSA6","SBSA","Female",1,null,"Diploma in Office Management and Administration","Diploma","No","Yes",4,4,4,"Yes","Yes it was just right","Unemployed","","Potential labour force entrant ",0,0,0,0,0,"#NULL!","#NULL!","#NULL!","#NULL!","#NULL!","#NULL!","#NULL!","#NULL!","#NULL!","#NULL!",{"$error":"#NULL!"},"#NULL!","","#NULL!","No","No","",3,"#NULL!","#NULL!","#NULL!",{"$error":"#NULL!"},"Yes",0,0,"#NULL!",""]
[7,"SBSA7","SBSA","Female",1,null,"Diploma in Office Management and Administration","Diploma","No","No",4,5,"#NULL!","Yes","Yes it was just right","Further Studies","","Further Studies",0,0,0,0,0,"#NULL!","#NULL!","#NULL!","#NULL!","#NULL!","#NULL!","#NULL!","#NULL!","#NULL!","#NULL!",{"$error":"#NULL!"},"#NULL!","","#NULL!","#NULL!","#NULL!","","#NULL!","#NULL!","#NULL!","#NULL!",{"$error":"#NULL!"},"#NULL!","Upgrading Programme","Seychelles Institute of Teacher Education (SITE)",1,""]
[8,"SBSA8","SBSA","Female",1,null,"Diploma in Office Management and Administration","Diploma","No","Yes",4,3,3,"Yes","Yes it was just right","Unemployed","","Further Studies",0,0,0,0,0,"#NULL!","#NULL!","#NULL!","#NULL!","#NULL!","#NULL!","#NULL!","#NULL!","#NULL!","#NULL!",{"$error":"#NULL!"},"#NULL!","","#NULL!","#NULL!","#NULL!","","#NULL!","#NULL!","#NULL!","#NULL!",{"$error":"#NULL!"},"#NULL!","Bsc in Business Administration","University of Seychelles","#NULL!",""]
[9,"SBSA9","SBSA","Female",1,null,"Diploma in Business Studies and Accounting","#NULL!","No","Yes",4,5,4,"Yes","Yes it was just right","Full time Employment","","Employed","Yes","Administrative and support services activities","Private","7° South","Account Assistant",1,1,0,0,0,0,0,0,"#NULL!",1,{"$error":"#NULL!"},"Just this 1","Less than 1 month","Often","#NULL!","#NULL!","","#NULL!","#NULL!","#NULL!","#NULL!",{"$error":"#NULL!"},"#NULL!",0,0,"#NULL!",""]
[10,"SBSA10","SBSA","Female",1,null,"Diploma in Business Studies and Accounting","#NULL!","No","Yes",5,4,4,"Yes","Yes it was just right","Full time Employment","","Employed","Yes","Professional, scientific and technical activities","Private","BDO Associates","Junior Auditor",1,1,0,0,0,0,0,0,"#NULL!",8,{"$error":"#NULL!"},"between 2 to 5","Less than 1 month","Often","#NULL!","#NULL!","","#NULL!","#NULL!","No","#NULL!",{"$error":"#NULL!"},"#NULL!",0,0,"#NULL!",""]
[11,"SBSA11","SBSA","Female",1,null,"Diploma in Business Studies and Accounting","Diploma","No","Yes",4,4,4,"Yes","Yes it was just right","Full time Employment","","Employed","Yes","Professional, scientific and technical activities","Private","Baker Tilly","Executive Auditor",1,0,1,0,0,0,0,0,3,5,{"$error":"#NULL!"},"Just this 1","Less than 1 month","Often","#NULL!","#NULL!","","#NULL!","#NULL!","#NULL!","#NULL!",{"$error":"#NULL!"},"#NULL!",0,0,"#NULL!",""]
[12,"SBSA12","SBSA","Female",1,null,"Diploma in Business Studies and Accounting","Diploma","No","Yes",4,4,4,"Yes","Yes it was just right","Full time Employment","","Employed","Yes","Public Administration and defence; compulsory social security","Public Service","Ministry of Finance, Trade, Investment & Economic Planning","Account Technician",1,1,0,0,0,0,1,0,3,4,{"$error":"#NULL!"},"Just this 1","Less than 1 month","Often","#NULL!","#NULL!","","#NULL!","#NULL!","#NULL!","#NULL!",{"$error":"#NULL!"},"#NULL!",0,0,"#NULL!",""]
[13,"SBSA13","SBSA","Female",1,null,"Diploma in Office Management and Administration","Diploma","No","Yes",5,5,5,"Yes","Yes it was just right","Short term contract",null,"Employed","Yes","Public Administration and defence; compulsory social security","Public Service","Ministry of Environment, Energy and Climate Change","Office Assistant",1,1,0,0,0,0,0,0,3,1,{"$error":"#NULL!"},"Just this 1","Less than 1 month","Often","#NULL!","#NULL!","","#NULL!","#NULL!","#NULL!","#NULL!",{"$error":"#NULL!"},"#NULL!",0,0,"#NULL!",""]
[14,"SBSA14","SBSA","Female",1,null,"Diploma in Office Management and Administration","Diploma","No","Yes",4,4,4,"Yes","Yes it was just right","Full time Employment","","Employed","Yes","Public Administration and defence; compulsory social security","Public Service","Department of Public Administration","Office Assistant",1,1,0,0,0,0,0,0,2,1,{"$error":"#NULL!"},"between 2 to 5","Less than 1 month","Always","#NULL!","#NULL!","","#NULL!","#NULL!","#NULL!","#NULL!",{"$error":"#NULL!"},"#NULL!",0,0,"#NULL!",""]
[15,"SBSA15","SBSA","Female",1,null,"Diploma in Office Management and Administration","Diploma","No","Yes",4,3,4,"Yes","Yes it was just right","Full time Employment","","Employed","Yes","Public Administration and defence; compulsory social security","Public Service","Registration Division","Senior Registration Officer",2,0,0,0,1,0,0,0,3,5,{"$error":"#NULL!"},"Just this 1","Less than 1 month","Often","#NULL!","#NULL!","","#NULL!","#NULL!","#NULL!","#NULL!",{"$error":"#NULL!"},"#NULL!",0,0,"#NULL!",""]
[16,"SBSA16","SBSA","Female",1,null,"Diploma in Office Management and Administration","Diploma","Yes","Yes",5,5,4,"Yes","Yes it was just right","Short term contract","","Employed","Yes","Manufacturing","Private","United Concrete Products Seychelles Ltd","Human Resource Assistant",1,0,0,0,1,0,0,0,2,9,"Through The Director at SBSA","#NULL!","Less than 1 month","Always","#NULL!","#NULL!","","#NULL!","#NULL!","#NULL!","#NULL!",{"$error":"#NULL!"},"#NULL!",0,0,"#NULL!",""]
[17,"SBSA17","SBSA","Female",1,null,"Diploma in Office Management and Administration","Diploma","No","Yes",4,4,4,"Yes","Yes it was just right","Full time Employment","","Employed","Yes","Accommodation and food service activities","Private","Constance Ephelia Resort","Account Receivable Officer",1,0,1,0,0,0,0,0,2,6,{"$error":"#NULL!"},"between 2 to 5","Less than 1 month","Always","#NULL!","#NULL!","","#NULL!","#NULL!","#NULL!","#NULL!",{"$error":"#NULL!"},"#NULL!",0,0,"#NULL!",""]
[18,"SBSA18","SBSA","Female",1,null,"Diploma in Office Management and Administration","Diploma","No","Yes",4,5,4,"Yes","Yes it was just right","Full time Employment","","Employed","Yes","Other service activities","Private","Sonny Hairstylist","Supervisor",1,0,0,0,0,1,0,0,2,5,{"$error":"#NULL!"},"Just this 1","Less than 1 month","Always","#NULL!","#NULL!","","#NULL!","#NULL!","#NULL!","#NULL!",{"$error":"#NULL!"},"#NULL!",0,0,"#NULL!",""]
[19,"SBSA19","SBSA","Male",null,1,"Diploma in Office Management and Administration","Diploma","No","Yes",5,4,5,"Yes","Yes it was just right","Full time Employment","","Employed","Yes","Public Administration and defence; compulsory social security","Public Service","Immigration and Civil Status Department","Immigration Officer",2,0,1,0,0,0,0,0,4,4,{"$error":"#NULL!"},"between 2 to 5","Less than 1 month","Often","#NULL!","#NULL!","","#NULL!","#NULL!","#NULL!","#NULL!",{"$error":"#NULL!"},"#NULL!",0,0,"#NULL!",""]
[20,"SBSA20","SBSA","Female",1,null,"Diploma in Office Management and Administration","Diploma","No","No",5,4,1,"Yes","Yes it was just right","Short term contract","","Employed","Yes","Financial and insurance activities","Parastatal","Seychelles Commercial Bank","Bank Clerk",2,0,0,0,0,1,0,1,2,1,{"$error":"#NULL!"},"Just this 1","More than 1 month","Often","#NULL!","#NULL!","","#NULL!","#NULL!","#NULL!","#NULL!",{"$error":"#NULL!"},"#NULL!",0,0,"#NULL!",""]
[21,"SBSA21","SBSA","Male",null,1,"Diploma in Office Management and Administration","Diploma","No","Yes",5,"#NULL!","#NULL!","Yes","Yes it was just right","Full time Employment","","Employed","Yes","Financial and insurance activities","Private","Mauritius Commercial Bank","Centralised Operation Support",1,1,0,0,0,0,0,0,2,6,{"$error":"#NULL!"},"Just this 1","Less than 1 month","Always","#NULL!","#NULL!","","#NULL!","#NULL!","#NULL!","#NULL!",{"$error":"#NULL!"},"#NULL!",0,0,"#NULL!",""]
[22,"SBSA22","SBSA","Male",null,1,"Diploma in Office Management and Administration","Diploma","No","Yes",5,4,4,"Yes","Yes it was just right","Further Studies","","Further Studies",0,0,0,0,0,"#NULL!","#NULL!","#NULL!","#NULL!","#NULL!","#NULL!","#NULL!","#NULL!","#NULL!","#NULL!",{"$error":"#NULL!"},"#NULL!","","#NULL!","#NULL!","#NULL!","","#NULL!","#NULL!","#NULL!","#NULL!",{"$error":"#NULL!"},"#NULL!",0,0,"#NULL!",""]
[23,"SBSA23","SBSA","Female",1,null,"Diploma in Business Studies and Accounting","Diploma","No","Yes",4,4,4,"Yes","Yes it was just right","Further Studies","","Further Studies",0,0,0,0,0,"#NULL!","#NULL!","#NULL!","#NULL!","#NULL!","#NULL!","#NULL!","#NULL!","#NULL!","#NULL!",{"$error":"#NULL!"},"#NULL!","","#NULL!","#NULL!","#NULL!","","#NULL!","#NULL!","#NULL!","#NULL!",{"$error":"#NULL!"},"#NULL!","Forensic Accounting","Asia Pacific University",1,""]
[24,"SBSA24","SBSA","Female",1,null,"Diploma in Office Management and Administration","Diploma","No","Yes",5,5,4,"Yes","Yes it was just right","Short term contract","","Employed","Yes","Public Administration and defence; compulsory social security","Public Service","Registration Division","Accounts Department","#NULL!","#NULL!","#NULL!","#NULL!","#NULL!","#NULL!","#NULL!","#NULL!","#NULL!","#NULL!",{"$error":"#NULL!"},"#NULL!","","#NULL!","#NULL!","#NULL!","","#NULL!","#NULL!","#NULL!","#NULL!",{"$error":"#NULL!"},"#NULL!",0,0,"#NULL!",""]
[25,"SBSA25","SBSA","Female",1,null,"Diploma in Business Studies and Accounting","Diploma","No","Yes",4,4,4,"Yes","Yes it was just right","Unemployed","","Further Studies",0,0,0,0,0,"#NULL!","#NULL!","#NULL!","#NULL!","#NULL!","#NULL!","#NULL!","#NULL!","#NULL!","#NULL!",{"$error":"#NULL!"},"#NULL!","","#NULL!","No","No","",3,"#NULL!","#NULL!",9,"Going For Further Studies","Yes","BA (Hons) Accounting and Finance","Asia Pacific University","#NULL!",""]
[26,"SBSA26","SBSA","Female",1,null,"Diploma in Business Studies and Accounting","Diploma","No","Yes",5,4,4,"Yes","Yes it was just right","Further Studies","","Further Studies",0,0,0,0,0,"#NULL!","#NULL!","#NULL!","#NULL!","#NULL!","#NULL!","#NULL!","#NULL!","#NULL!","#NULL!",{"$error":"#NULL!"},"#NULL!","","#NULL!","#NULL!","#NULL!","","#NULL!","#NULL!","#NULL!","#NULL!",{"$error":"#NULL!"},"#NULL!","BA in Accounting and Finance with Specialised in Forensic Accounting","Asia Pacific University",3,""]
[27,"SBSA27","SBSA","Female",1,null,"Diploma in Business Studies and Accounting","Diploma","No","Yes",4,4,4,"Yes","Yes it was just right","Unemployed","","Potential labour force entrant ",0,0,0,0,0,"#NULL!","#NULL!","#NULL!","#NULL!","#NULL!","#NULL!","#NULL!","#NULL!","#NULL!","#NULL!",{"$error":"#NULL!"},"#NULL!","","#NULL!","No","No","",3,"#NULL!","#NULL!","#NULL!",{"$error":"#NULL!"},"#NULL!",0,0,"#NULL!",""]
[28,"SBSA28","SBSA","Female",1,null,"Diploma in Business Studies and Accounting","Diploma","No","Yes",4,4,3,"Yes","Yes it was just right","Further Studies","","Further Studies",0,0,0,0,0,"#NULL!","#NULL!","#NULL!","#NULL!","#NULL!","#NULL!","#NULL!","#NULL!","#NULL!","#NULL!",{"$error":"#NULL!"},"#NULL!","","#NULL!","#NULL!","#NULL!","","#NULL!","#NULL!","#NULL!","#NULL!",{"$error":"#NULL!"},"#NULL!","ACCA","The Guy Morel Institute",1,""]
[29,"SBSA29","SBSA","Female",1,null,"Diploma in Business Studies and Accounting","Diploma","No","Yes",4,4,4,"Yes","Yes it was just right","Unemployed","","Further Studies",0,0,0,0,0,"#NULL!","#NULL!","#NULL!","#NULL!","#NULL!","#NULL!","#NULL!","#NULL!","#NULL!","#NULL!",{"$error":"#NULL!"},"#NULL!","","#NULL!","No","Yes","",3,2,"Yes",9,"Going For Further Studies","#NULL!","BA in Accounting and Finance with Specialised in forex and investment","Asia Pacific University","#NULL!",""]
[30,"SBSA30","SBSA","Female",1,null,"Diploma in Office Management and Administration","Diploma","No","Yes",5,"#NULL!","#NULL!","Yes","Yes it was just right","Part time Employment","","Employed","Yes","Arts, entertainment and recreation","Private","Moorings",0,"#NULL!",0,0,0,0,1,0,0,3,5,{"$error":"#NULL!"},"between 2 to 5","More than 1 month","Always","#NULL!","#NULL!","","#NULL!","#NULL!","#NULL!","#NULL!",{"$error":"#NULL!"},"#NULL!",0,0,"#NULL!",""]
[31,"SBSA31","SBSA","Female",1,null,"Diploma in Business Studies and Accounting","Diploma","No","Yes",4,5,4,"Yes","Yes it was just right","Unemployed","","Further Studies",0,0,0,0,0,"#NULL!","#NULL!","#NULL!","#NULL!","#NULL!","#NULL!","#NULL!","#NULL!","#NULL!","#NULL!",{"$error":"#NULL!"},"#NULL!","","#NULL!","No","No","",1,1,"Yes",9,"Going For Further Studies","No","BSC Accounting","The Guy Morel Institute","#NULL!",""]
[32,"SBSA32","SBSA","Female",1,null,"Diploma in Office Management and Administration","Diploma","No","No",5,4,5,"Yes","No, I should have learned something else","Unemployed","","Further Studies",0,0,0,0,0,"#NULL!","#NULL!","#NULL!","#NULL!","#NULL!","#NULL!","#NULL!","#NULL!","#NULL!","#NULL!",{"$error":"#NULL!"},"#NULL!","","#NULL!","No","No","",3,2,"Yes",5,{"$error":"#NULL!"},"No","Diploma in Construction","Seychelles Institute of Technology (SIT)","#NULL!",""]
[33,"SBSA33","SBSA","Male",null,1,"Diploma in Office Management and Administration","Diploma","No","Yes",4,4,5,"Yes","Yes it was just right","Full time Employment","","Employed","Unknown","Unknown","Not Stated","Not Stated",0,"#NULL!","#NULL!","#NULL!","#NULL!","#NULL!","#NULL!","#NULL!","#NULL!","#NULL!","#NULL!",{"$error":"#NULL!"},"#NULL!","","#NULL!","#NULL!","#NULL!","","#NULL!","#NULL!","#NULL!","#NULL!",{"$error":"#NULL!"},"#NULL!",0,0,"#NULL!",""]
[34,"SBSA34","SBSA","Male",null,1,"Diploma in Office Management and Administration","Diploma","Yes","Yes",5,1,1,"Yes","Yes it was just right","Short term contract","","Employed","Yes","Transportation and storage","Parastatal","Air Seychelles","Accounting Trainee",9,0,0,0,0,0,0,1,2,9,"From a Lecturer","more than 5","Less than 1 month","Often","#NULL!","#NULL!","","#NULL!","#NULL!","#NULL!","#NULL!",{"$error":"#NULL!"},"#NULL!",0,0,"#NULL!",""]
[35,"SBSA35","SBSA","Female",1,null,"Diploma in Business Studies and Accounting","Diploma","No","Yes",5,5,4,"Yes","Yes it was just right","Part time Employment","","Employed","Yes","Wholesale and retail trade; repair of motor vehicles and motorcycles","Parastatal","Seychelles Trading Company ","Accounts Technician Trainee",1,1,0,0,0,0,0,0,3,4,{"$error":"#NULL!"},"between 2 to 5","More than 1 month","Often","#NULL!","#NULL!","","#NULL!","#NULL!","#NULL!","#NULL!",{"$error":"#NULL!"},"#NULL!",0,0,"#NULL!",""]
[36,"SBSA36","SBSA","Female",1,null,"Diploma in Office Management and Administration","Diploma","No","Yes",5,1,5,"Yes","Yes it was just right","Full time Employment","","Employed","Yes","Public Administration and defence; compulsory social security","Public Service","Seychelles National Assembly","Assistant Parliamentary Reporter",1,0,0,0,1,0,0,1,3,"#NULL!",{"$error":"#NULL!"},"between 2 to 5","More than 1 month","Always","#NULL!","#NULL!","","#NULL!","#NULL!","#NULL!","#NULL!",{"$error":"#NULL!"},"#NULL!",0,0,"#NULL!",""]
[37,"SBSA37","SBSA","Male",null,1,"Diploma in Office Management and Administration","Diploma","No","No",4,4,4,"Yes","No, I should have learned something else","Full time Employment","","Employed","Yes","Financial and insurance activities","Private","Mauritius Commercial Bank","Centralised Operation Support",1,0,0,1,0,0,0,0,2,4,{"$error":"#NULL!"},"Just this 1","Less than 1 month","Often","#NULL!","#NULL!","","#NULL!","#NULL!","#NULL!","#NULL!",{"$error":"#NULL!"},"#NULL!",0,0,"#NULL!",""]
[38,"SBSA38","SBSA","Female",1,null,"Diploma in Office Management and Administration","Diploma","No","Yes",4,4,3,"Yes","Yes it was just right","Full time Employment","","Employed","Yes","Public Administration and defence; compulsory social security","Public Service","Department of Foreign Affairs","Office Assistant","#NULL!","#NULL!","#NULL!","#NULL!","#NULL!","#NULL!","#NULL!","#NULL!","#NULL!","#NULL!",{"$error":"#NULL!"},"#NULL!","","#NULL!","#NULL!","#NULL!","","#NULL!","#NULL!","#NULL!","#NULL!",{"$error":"#NULL!"},"#NULL!",0,0,"#NULL!",""]
[39,"SBSA39","SBSA","Female",1,null,"Diploma in Office Management and Administration","Diploma","No","Yes",5,4,4,"Yes","Yes it was just right","Part time Employment","","Employed","Yes","Public Administration and defence; compulsory social security","Public Service","Ministry of Home Affairs","Private Secretary","#NULL!",1,0,0,0,0,0,0,3,4,{"$error":"#NULL!"},"between 2 to 5","Less than 1 month","Always","#NULL!","#NULL!","","#NULL!","#NULL!","#NULL!","#NULL!",{"$error":"#NULL!"},"#NULL!",0,0,"#NULL!",""]
{"$rows_left_out":493}
{"sheet":"Home","index":2,"n_rows":30,"n_cols":7,"rows_kept":30,"cut":false,"hidden":false,"merged":[]}
[]
[]
[]
[]
[]
[]
[]
[]
[]
[]
[]
[]
[]
[]
[]
[]
[]
[]
[]
[]
[]
[]
[]
[]
[]
[]
[]
[]
[]
[null,null,null,null,null,"Programme followed","(All)"]

{"sheet":"General Information","index":3,"n_rows":30,"n_cols":7,"rows_kept":30,"cut":false,"hidden":false,"merged":[]}
[]
[]
[]
[]
[]
[]
[]
[]
[]
[]
[]
[]
[]
[]
[]
[]
[]
[]
[]
[]
[]
[]
[]
[]
[]
[]
[]
[]
[]
[null,null,null,null,null,"Programme followed","(All)"]

{"sheet":"Employment Information","index":4,"n_rows":53,"n_cols":29,"rows_kept":53,"cut":false,"hidden":false,"merged":[]}
[]
[]
[]
[]
[]
[]
[]
[]
[]
[]
[]
[]
[]
[]
[]
[]
[]
[]
[]
[]
[]
[]
[]
[]
[]
[]
[]
[]
[]
[null,null,null,null,null,"Programme followed","(All)"]
[]
[]
[]
[]
[]
[]
[]
[]
[]
[]
{"$rows_left_out":14}
{"sheet":"Further Studies","index":5,"n_rows":36,"n_cols":28,"rows_kept":36,"cut":false,"hidden":false,"merged":[]}
[]
[]
[]
[]
[]
[]
[]
[]
[]
[]
[]
[]
[]
[]
[]
[]
[]
[]
[]
[]
[]
[]
[]
[]
[]
[null,null,null,null,null,null,null,null,null,null,null,null,null,null,null,null,null,null,null,null,null,null,null,"Programme","Number",null,null,1]
[null,null,null,null,null,null,null,null,null,null,null,null,null,null,null,null,null,null,null,null,null,null,null,{"$f":"INDEX(Pivot!$F$281:$G$323,$AB$26+ROWS($Z$27:Z27)-1,COLUMNS($Z$27:Z27))","v":"BSC in Tourism Management"},{"$f":"INDEX(Pivot!$F$281:$G$323,$AB$26+ROWS($Z$27:AA27)-1,COLUMNS($Z$27:AA27))","v":1}]
[null,null,null,null,null,null,null,null,null,null,null,null,null,null,null,null,null,null,null,null,null,null,null,{"$f":"INDEX(Pivot!$F$281:$G$323,$AB$26+ROWS($Z$27:Z28)-1,COLUMNS($Z$27:Z28))","v":"ACCA"},{"$f":"INDEX(Pivot!$F$281:$G$323,$AB$26+ROWS($Z$27:AA28)-1,COLUMNS($Z$27:AA28))","v":1}]
[null,null,null,null,null,null,null,null,null,null,null,null,null,null,null,null,null,null,null,null,null,null,null,{"$f":"INDEX(Pivot!$F$281:$G$323,$AB$26+ROWS($Z$27:Z29)-1,COLUMNS($Z$27:Z29))","v":"Advanced Certificate in Agriculture"},{"$f":"INDEX(Pivot!$F$281:$G$323,$AB$26+ROWS($Z$27:AA29)-1,COLUMNS($Z$27:AA29))","v":1}]
[null,null,null,null,null,"Programme followed","(All)",null,null,null,null,null,null,null,null,null,null,null,null,null,null,null,null,{"$f":"INDEX(Pivot!$F$281:$G$323,$AB$26+ROWS($Z$27:Z30)-1,COLUMNS($Z$27:Z30))","v":"Upgrading Programme"},{"$f":"INDEX(Pivot!$F$281:$G$323,$AB$26+ROWS($Z$27:AA30)-1,COLUMNS($Z$27:AA30))","v":1}]
[null,null,null,null,null,null,null,null,null,null,null,null,null,null,null,null,null,null,null,null,null,null,null,{"$f":"INDEX(Pivot!$F$281:$G$323,$AB$26+ROWS($Z$27:Z31)-1,COLUMNS($Z$27:Z31))","v":"Diploma in Administration and Management"},{"$f":"INDEX(Pivot!$F$281:$G$323,$AB$26+ROWS($Z$27:AA31)-1,COLUMNS($Z$27:AA31))","v":1}]
[null,null,null,null,null,null,null,null,null,null,null,null,null,null,null,null,null,null,null,null,null,null,null,{"$f":"INDEX(Pivot!$F$281:$G$323,$AB$26+ROWS($Z$27:Z32)-1,COLUMNS($Z$27:Z32))","v":"Art in Primary & Secondary School"},{"$f":"INDEX(Pivot!$F$281:$G$323,$AB$26+ROWS($Z$27:AA32)-1,COLUMNS($Z$27:AA32))","v":1}]
[null,null,null,null,null,null,null,null,null,null,null,null,null,null,null,null,null,null,null,null,null,null,null,{"$f":"INDEX(Pivot!$F$281:$G$323,$AB$26+ROWS($Z$27:Z33)-1,COLUMNS($Z$27:Z33))","v":"Diploma in Construction"},{"$f":"INDEX(Pivot!$F$281:$G$323,$AB$26+ROWS($Z$27:AA33)-1,COLUMNS($Z$27:AA33))","v":1}]
[null,null,null,null,null,null,null,null,null,null,null,null,null,null,null,null,null,null,null,null,null,null,null,{"$f":"INDEX(Pivot!$F$281:$G$323,$AB$26+ROWS($Z$27:Z34)-1,COLUMNS($Z$27:Z34))","v":"BA (Hons) Accounting and Finance"},{"$f":"INDEX(Pivot!$F$281:$G$323,$AB$26+ROWS($Z$27:AA34)-1,COLUMNS($Z$27:AA34))","v":1}]
[null,null,null,null,null,null,null,null,null,null,null,null,null,null,null,null,null,null,null,null,null,null,null,{"$f":"INDEX(Pivot!$F$281:$G$323,$AB$26+ROWS($Z$27:Z35)-1,COLUMNS($Z$27:Z35))","v":"Diploma in Mechanical and Electrical Engineering "},{"$f":"INDEX(Pivot!$F$281:$G$323,$AB$26+ROWS($Z$27:AA35)-1,COLUMNS($Z$27:AA35))","v":1}]
[null,null,null,null,null,null,null,null,null,null,null,null,null,null,null,null,null,null,null,null,null,null,null,{"$f":"INDEX(Pivot!$F$281:$G$323,$AB$26+ROWS($Z$27:Z36)-1,COLUMNS($Z$27:Z36))","v":"BA in Accounting and Finance with Specialised in forex and investment"},{"$f":"INDEX(Pivot!$F$281:$G$323,$AB$26+ROWS($Z$27:AA36)-1,COLUMNS($Z$27:AA36))","v":1}]